{"text_format":"1","workbook":"xlsx","n_sheets":3,"sheets":["Foglio1","Foglio2","Foglio3"],"not_rendered":{"charts":0,"images":0,"macros":1,"external_links":0,"defined_names":0,"comments":0,"pivot_tables":0},"unopened":[],"bounds":{"document_bytes":16777216,"sheet_cells":100000,"rows_first":2000,"rows_last":500,"rows_between":2000,"halvings":0,"cell_chars":16384,"cell_head_chars":4096},"cells_cut":0,"cells_raw":0,"read":"whole","date_system":"1900"}

{"sheet":"Foglio1","index":0,"n_rows":52,"n_cols":54,"rows_kept":52,"cut":false,"hidden":false,"merged":[[22,11,22,14],[37,1,37,3],[46,1,46,14],[47,1,47,14],[48,1,48,14],[24,13,24,14],[26,7,26,14],[28,7,28,14],[30,9,30,14],[30,2,30,5],[30,6,30,8],[33,1,33,6],[24,0,24,1],[24,2,24,5],[24,7,24,11],[26,1,26,5],[49,1,49,14],[51,0,51,14],[3,2,3,11],[32,0,32,14],[14,0,14,14],[41,5,41,14],[22,2,22,9],[39,0,39,14],[41,0,41,1],[43,0,43,14],[44,1,44,14],[45,1,45,14],[35,1,35,6],[37,5,37,7],[18,2,18,14],[20,3,20,14],[28,0,28,6],[18,0,18,1],[20,0,20,2],[22,0,22,1],[9,1,9,10],[12,1,12,10],[8,1,8,11],[11,1,11,13],[0,2,0,11],[1,2,1,11],[5,5,5,8],[6,0,6,14]]}
[null,null,"Corso di Studi in Ingegneria Elettrica"]
[null,null,"Università di Cagliari - Facoltà di Ingegneria e Architettura "]
[]
[null,null," Laurea Magistrale (Classe LM-28, DM 270/2004)",null,null,null,null,null,null,null,null,null,null,"Bollo"]
[]
[null,null,null,null,null,"A.A. 2022/2023"]
["(per studenti delle coorti 2020/2021, 2021/2022 e 2022/2023)"]
[]
[null,"Modulo per la presentazione del Piano di Studi (con marca da bollo)"]
[null,"Scadenza: 31 ottobre 2022"]
[]
[null,"Modulo per l'indicazione e/o la modifica delle sole attività a scelta dello studente e delle ulteriori attività formative, come seminari o tirocini (esente da bollo)"]
[null,"Scadenza: nessuna scadenza - può essere presentato in qualsiasi momento"]
[]
["Se lo studente ha già presentato in passato un piano di studi personale, il presente modulo deve essere completato riportando integralmente l'ultimo piano di studi approvato, di cui deve essere allegata copia."]
[]
["Campo  OBBLIGATORIO",null,null,null,null,null,null,"Campo NON obbligatorio"]
[]
["Matricola n."]
[]
["Il/La sottoscritto/a"]
[]
["nato/a a",null,null,null,null,null,null,null,null,null,"il"]
[]
["domiciliato/a a",null,null,null,null,null,"in via",null,null,null,null,null,"n."]
[]
["tel.",null,null,null,null,null,"e-mail"]
[]
["laurea triennale di provenienza e anno di iscrizione"]
[]
["curriculum",null,null,null,null,null,"conseguita presso"]
[]
["regolarmente iscritto al Corso di Laurea Magistrale in Ingegneria Elettrica, chiede che venga esaminato il presente Piano di Studi."]
[null,"Ha già presentato un piano di studi personale",null,null,null,null,null,null,null,null,null,null,null,null,null,null,null,null,null,null,null,null,null,null,null,null,null,null,null,null,null,null,null,null,null,null,null,null,null,null,null,null,null,null,null,null,null,null,null,null,null,null,null,false]
[]
[null,"Ha presentato domanda di passaggio di corso",null,null,null,null,null,null,null,null,null,null,null,null,null,null,null,null,null,null,null,null,null,null,null,null,null,null,null,null,null,null,null,null,null,null,null,null,null,null,null,null,null,null,null,null,null,null,null,null,null,null,null,false]
[]
["Data:",null,null,null,null,"Firma dello studente"]
[]
["Il Consiglio del CdS in Ingegneria Elettrica ha approvato il Piano di Studi."]
[]
["Verbale n.",null,null,null,null,"Il Coordinatore del CdS"]
[]
["Istruzioni per la compilazione"]
["1)","Per ogni riga riportare i crediti dell'insegnamento previsto nella colonna corrispondente alla tipologia (B, C, D, E ed F). Se l'esame è già stato sostenuto, selzionare \"SI\" nella casella corrispondente della colonna 7. "]
["2)","Indicare nella riga A scelta libera dello studente (e nelle righe successive, se necessario) gli insegnamenti opzionali e le altre attività (es. Borse di Ricerca DIEE), riportando il numero di crediti relativo nella colonna D."]
["3)","Indicare nella riga Altre attività (e nelle righe successive, se necessario) gli eventuali Seminari, Tirocini, Conoscenze linguistiche e riportare il relativo numero di crediti nella colonna F."]
["4)","Indicare gli eventuali esami Socrates-Erasmus secondo il piano didattico concordato."]
["5)","È possibile indicare in colonna 6 esami in sostituzione degli insegnamenti previsti nel Manifesto (colonna 4), nel rispetto dei vincoli previsti nell'Ordinamento del Corso di Studi, riportati nell'ultima pagina del presente modulo."]
["6)","Nel caso in cui nel piano di studi compaia un'INTERA attività a scelta non necessaria ai fini del raggiungimento dei 120 CFU, barrare in corrispondenza della colonna S (crediti sovranumerari)."]
[]
["L'approvazione delle sostituzioni e delle attività a scelta è comunque subordinata all'esame da parte del Consiglio del CdS."]

{"sheet":"Foglio2","index":1,"n_rows":52,"n_cols":53,"rows_kept":52,"cut":false,"hidden":false,"merged":[[48,0,48,13],[50,0,50,13],[42,1,42,13],[43,1,43,13],[44,1,44,13],[46,0,46,3],[46,4,46,13],[41,1,41,13],[19,5,20,5],[21,3,21,4],[22,0,23,0],[22,1,23,1],[22,2,23,2],[22,3,23,4],[22,5,23,5],[24,3,24,4],[26,3,26,4],[31,3,31,4],[39,0,39,4],[40,0,40,1],[12,3,12,4],[18,3,18,4],[19,0,20,0],[19,1,20,1],[19,2,20,2],[19,3,20,4],[0,7,0,13],[1,7,1,13],[2,0,2,13],[8,3,8,4],[9,3,9,4],[10,5,11,5],[10,2,11,2],[10,1,11,1],[0,0,1,2],[0,3,1,3],[3,3,3,4],[4,3,4,4],[5,3,5,4],[6,3,7,4],[0,4,1,6],[6,0,7,0],[6,1,7,1],[6,2,7,2],[6,5,7,5],[10,0,11,0],[10,3,11,4]]}
["LM Ingegneria Elettrica",null,null,"Studente:",{"$f":"IF(Foglio1!D21=0,\"\",Foglio1!D21)","v":""},null,null,"Matricola"]
[null,null,null,null,null,null,null,{"$f":"IF(Foglio1!C19=0,\"\",Foglio1!C19)","v":""}]
["Legenda \nB = Caratterizzanti; C = Affini; D = a Scelta Libera; E = Tesi; F = Altre attività; S = Sovranumerari; CI = Corso Integrato"]
[1,2,3,4,null,5,6,7,9,10,11,12,13,14]
["Anno","Settore Disciplinare","Tipo","Insegnamenti a Manifesto",null,"CFU","Insegnamenti Sostitutivi","Sostenuto","B","C","D","E","F","S"]
[null,null,null,null,null,null,null,null,null,null,null,null,null,null,null,null,null,null,null,null,null,null,null,null,null,null,null,null,null,null,null,null,null,null,null,null,null,null,null,null,null,null,null,null,null,null,null,null,null,null,null,null,"SI"]
[1,"ING-IND/33","B","Sistemi Elettrici per l'Energia - CI (1)",null,12,null,"NO",null,null,null,null,null,null,null,null,null,null,null,null,null,null,null,null,null,null,null,null,null,null,null,null,null,null,null,null,null,null,null,null,null,null,null,null,null,null,null,null,null,null,null,null,"NO"]
[null,null,null,null,null,null,null,"NO"]
[1,"ING-INF/07","B","Misure per l'Energia Elettrica",null,9,null,"NO"]
[1,"ING-INF/04","C","Analisi e Controllo dei Sistemi Multivariabili",null,6,null,"NO"]
[1,"ING-IND/32","B","Energetica Elettrica e \nVeicoli Elettrici - CI",null,10,null,"NO"]
[null,null,null,null,null,null,null,"NO"]
[1,"ING-IND/28","C","Salute e Sicurezza sul Lavoro (2)",null,6,null,"NO"]
[]
[]
[]
[]
[]
[2,"ING-IND/31","B","Elettromagnetismo applicato all'Ingegneria Elettrica ed Energetica",null,9,null,"NO"]
[2,"ING-IND/32","B","Sistemi di Conversione dell'Energia e Propulsione Elettrica - CI (1)",null,12,null,"NO"]
[null,null,null,null,null,null,null,"NO"]
[2,"ING-IND/33","B","Impianti di Produzione dell'Energia Elettrica (1)",null,9,null,"NO"]
[2,"ING-IND/31","B","Progetto di sistemi per l'elaborazione del segnale - CI",null,12,null,"NO"]
[null,null,null,null,null,null,null,"NO"]
[2,"-","E","Prova Finale",null,15,null,"NO"]
[]
[null,null,"D","A scelta libera dello studente (3)",null,15]
[]
[]
[]
[]
[null,null,"F","Ulteriori attività formative (4)",null,5]
[]
[]
[]
[]
[]
[]
[]
["Totale Crediti   ",null,null,null,null,{"$f":"SUM(F6:F39)","v":120},null,{"$f":"SUM(I40:M40)","v":0},{"$f":"SUM(I6:I39)","v":0},0,0,0,0]
["Note:"]
[1,"Se il corso è stato sostituito con la somma di più corsi (ad esempio, se sostenuti secondo un ordinamento precedente) indicare in righe separate i nomi dei singoli corsi sostitutivi e il relativo numero di crediti; in caso contrario, indicare il numero totale di crediti nella prima riga disponibile."]
[2,"Gli studenti che hanno sostenuto l'esame di \"Sicurezza del Lavoro e Difesa Ambientale\" durante la laurea triennale devono sostituire \"Salute e Sicurezza sul Lavoro\" con \"Sicurezza e Organizzazione del Lavoro in Cantiere\"."]
[3,"La scelta dei relativi crediti formativi deve essere coerente con il percorso formativo dello studente e deve avere l'approvazione vincolante del Consiglio di Corso di Studi."]
[4,"I 3 CFU della prova di lingua inglese potranno essere acquisiti superando il test di piazzamento di livello B2 presso il Centro Linguistico di Ateneo. Qualora lo studente sia in grado di presentare una certificazione che attesti la conoscenza della lingua inglese di livello B2 - intermedio - rilasciata da scuole/enti accreditati (o dallo stesso CLA), potrà scegliere di acquisire tutti i CFU attraverso altre attività (ad esempio tirocini, laboratori o seminari)."]
[]
["Annotazioni dello studente:"]
[]
[]
[]
[]
[null,null,null,null,null,null,"Firma dello studente:"]

{"sheet":"Foglio3","index":2,"n_rows":40,"n_cols":7,"rows_kept":40,"cut":false,"hidden":false,"merged":[[37,0,37,3],[39,1,39,6],[30,0,30,6],[31,0,31,3],[32,0,32,3],[33,0,36,1],[33,2,33,3],[34,2,34,3],[35,2,35,3],[36,2,36,3],[29,0,29,3],[13,6,16,6],[17,0,22,0],[17,1,22,3],[17,4,22,4],[17,5,22,5],[17,6,22,6],[23,0,28,0],[23,1,28,3],[23,4,28,4],[23,5,28,5],[23,6,28,6],[9,1,9,3],[10,0,10,6],[11,0,11,3],[12,0,12,6],[13,0,16,0],[13,1,16,3],[13,4,16,4],[13,5,16,5],[4,0,4,6],[7,0,7,6],[0,0,0,6],[1,0,1,6],[3,0,3,6]]}
["Corso di Studi in Ingegneria Elettrica"]
["Università di Cagliari - Facoltà di Ingegneria e Architettura "]
[]
["A.A. 2022/2023"]
["Allegato al modulo per la presentazione del piano di studi (Laurea Magistrale)"]
[]
[]
["Condizione necessaria, ma non sufficiente, perché i piani di studi personali possano essere approvati è che, anche dopo le modifiche apportate, risultino soddisfatti i vincoli previsti nell'Ordinamento del Corso di Studi, di seguito riassunti:"]
[]
[null,"Settori",null,null,"Numero minimo CFU","Numero massimo CFU","Validazione"]
["Attività caratterizzanti (tipologia B)"]
["ING-IND/31 Elettrotecnica\nING-IND/32 Convertitori, macchine e azionamenti elettrici\nING-IND/33 Sistemi elettrici per l'energia\nING-INF/07 Misure elettriche ed elettroniche",null,null,null,50,75,{"$f":"IF(AND(Foglio2!I40>=Foglio3!E12,Foglio2!I40<=Foglio3!F12),\"OK\",\"NO\")","v":"NO"}]
["Attività affini o integrative (tipologia C)"]
["A11","ICAR/08 Scienza delle costruzioni\nICAR/09 Tecnica delle costruzioni\nING-IND/14 Progettazione meccanica e costruzione di macchine\nING-IND/28 Ingegneria e sicurezza degli scavi",null,null,0,12]
[]
[]
[]
["A12","ING-IND/08 Macchine a fluido\nING-IND/09 Sistemi per l'energia e l'ambiente\nING-IND/11 Fisica tecnica ambientale\nING-IND/12 Misure meccaniche e termiche\nING-IND/35 Ingegneria economico-gestionale\nSECS-P/08 Economia e gestione delle imprese",null,null,0,12]
[]
[]
[]
[]
[]
["A13","ING-INF/01 Elettronica\nING-INF/02 Campi elettromagnetici\nING-INF/03 Telecomunicazioni\nING-INF/04 Automatica\nING-INF/05 Sistemi di elaborazione delle informazioni\nMAT/08 - Analisi numerica",null,null,6,18]
[]
[]
[]
[]
[]
["Intervallo complessivo di CFU per attività formative di tipologia C",null,null,null,12,24,{"$f":"IF(AND(Foglio2!J40>=Foglio3!E30,Foglio2!J40<=Foglio3!F30),\"OK\",\"NO\")","v":"NO"}]
["Altre attività"]
["A scelta libera dello studente (tipologia D)",null,null,null,9,15,{"$f":"IF(AND(Foglio2!K40>=Foglio3!E32,Foglio2!K40<=Foglio3!F32),\"OK\",\"NO\")","v":"NO"}]
["Per la prova finale (tipologia E)",null,null,null,12,15,{"$f":"IF(AND(Foglio2!L40>=Foglio3!E33,Foglio2!L40<=Foglio3!F33),\"OK\",\"NO\")","v":"NO"}]
["Ulteriori attività formative (tipologia F)",null,"Ulteriori conoscenze linguistiche",null,0,5]
[null,null,"Abilità informatiche e telematiche",null,0,4]
[null,null,"Tirocini formativi e di orientamento",null,0,6]
[null,null,"Altre conoscenze utili per l'inserimento nel mondo del lavoro",null,0,5]
["Intervallo complessivo di CFU per attività formative di tipologia F",null,null,null,1,20,{"$f":"IF(AND(Foglio2!M40>=Foglio3!E38,Foglio2!M40<=Foglio3!F38),\"OK\",\"NO\")","v":"NO"}]
[]
[null,"Per questi vincoli, lo studente deve effettuare la verifica manualmente e digitare OK in ciascun campo evidenziato"]